BDBM97356 Cyclobendazole::MLS003170852::N-[6-(cyclopropanecarbonyl)-1H-benzimidazol-2-yl]carbamic acid methyl ester::N-[6-[cyclopropyl(oxo)methyl]-1H-benzimidazol-2-yl]carbamic acid methyl ester::SMR001874769::cid_35803::methyl N-(6-cyclopropylcarbonyl-1H-benzimidazol-2-yl)carbamate::methyl N-[6-(cyclopropanecarbonyl)-1H-benzimidazol-2-yl]carbamate
SMILES COC(=O)Nc1nc2ccc(cc2[nH]1)C(=O)C1CC1
InChI Key InChIKey=OXLKOMYHDYVIDM-UHFFFAOYSA-N
Data  2 IC50
  Tab Delimited (TSV)   2D SDfile   Computed 3D by Vconf -m prep SDfile
Find this compound or compounds like it in BindingDB:
Activity Spreadsheet -- Enzyme Inhibition Constant Data from BindingDB
Found 2 hits for monomerid = 97356
TargetSteroidogenic factor 1(Homo sapiens (Human))
The Scripps Research Institute Molecular Screening Center
Curated by PubChem BioAssay
LigandPNGBDBM97356(Cyclobendazole | MLS003170852 | N-[6-(cyclopropane...)
Affinity DataIC50: >6.75E+4nM
In DepthDetails PCBioAssay
TargetNuclear receptor subfamily 0 group B member 1(Homo sapiens (Human))
The Scripps Research Institute Molecular Screening Center
Curated by PubChem BioAssay
LigandPNGBDBM97356(Cyclobendazole | MLS003170852 | N-[6-(cyclopropane...)
Affinity DataIC50: >6.75E+4nM
In DepthDetails PCBioAssay