BDBM987 Hydroxycoumarin deriv. 25::ethyl 3-[3-(4-hydroxy-2-oxo-2H-chromen-3-yl)propoxy]benzoate
SMILES CCOC(=O)c1cccc(OCCCc2c(O)c3ccccc3oc2=O)c1
InChI Key InChIKey=MXQQOMIHZHYIFT-UHFFFAOYSA-N
Data  1 IC50
  Tab Delimited (TSV)   2D SDfile   Computed 3D by Vconf -m prep SDfile
Find this compound or compounds like it in BindingDB:
Activity Spreadsheet -- Enzyme Inhibition Constant Data from BindingDB
Found 1 hit for monomerid = 987
TargetDimer of Gag-Pol polyprotein [489-587](Human immunodeficiency virus type 1)
Parke-Davis Pharmaceutical Research
LigandPNGBDBM987(Hydroxycoumarin deriv. 25 | ethyl 3-[3-(4-hydroxy-...)
Affinity DataIC50:  1.40E+3nMpH: 4.7 T: 2°C. Assay description: For determination of IC50 values, HIV-1 protease was added to assay buffer containing inhibitor and the substrate (H-His-Lys-Ala-Arg-Val-Leu- (p-NO2)...
In DepthDetails ArticlePubMed