Target
Sigma non-opioid intracellular receptor 1
Ligand
BDBM507028
Substrate
Meas. Tech.
Receptor Binding Assays
Ki
3039±n/a nM
Citation
 Martin, SFSahn, JJHodges, TR Piperazinyl norbenzomorphan compounds and methods for using the same US Patent  US11046670 Publication Date 6/29/2021 
Target
Name:
Sigma non-opioid intracellular receptor 1
Synonyms:
Aging-associated gene 8 protein SGMR1_HUMAN SIGMAR1 SR31747-binding protein Sigma 1-type opioid receptor Sigma1R | hSigmaR1
Type:
Enzyme Catalytic Domain
Mol. Mass.:
25124.85
Organism:
Homo sapiens (Human)
Description:
Q99720
Residue:
223
  
Inhibitor
Name:
BDBM507028
Synonyms:
US11046670, Compound 27
Type:
Small organic molecule
Emp. Form.:
C25H23NO2
Mol. Mass.:
369.4556
SMILES:
C(N1CC[C@@H]2C[C@@H]1c1cc(ccc21)-c1ccc2OCOc2c1)c1ccccc1
: