Target
Sigma intracellular receptor 2
Ligand
BDBM50232735
Substrate
Ki
27±n/a nM
Citation
 Martin, SFSahn, JJHodges, TR Piperazinyl norbenzomorphan compounds and methods for using the same US Patent  US11046670 Publication Date 6/29/2021 
Target
Name:
Sigma intracellular receptor 2
Synonyms:
MAC30 S2R Sigma-2 receptor TMEM97 | Transmembrane protein 97
Type:
Protein
Mol. Mass.:
20857.20
Organism:
Homo sapiens (Human)
Description:
Q5BJF2
Residue:
176
  
Inhibitor
Name:
BDBM50232735
Synonyms:
CHEMBL4069441 | US11046670, Compound 34
Type:
Small organic molecule
Emp. Form.:
C22H25Cl2N3O2S
Mol. Mass.:
466.424
SMILES:
[H][C@]12C[C@@]([H])(N(CC1)S(=O)(=O)c1cc(Cl)cc(Cl)c1)c1cc(ccc21)N1CCN(C)CC1
: