Target
Sigma intracellular receptor 2
Ligand
BDBM50232742
Substrate
Ki
16.2±n/a nM
Citation
 Martin, SFSahn, JJHodges, TR Piperazinyl norbenzomorphan compounds and methods for using the same US Patent  US11046670 Publication Date 6/29/2021 
Target
Name:
Sigma intracellular receptor 2
Synonyms:
MAC30 S2R Sigma-2 receptor TMEM97 | Transmembrane protein 97
Type:
Protein
Mol. Mass.:
20857.20
Organism:
Homo sapiens (Human)
Description:
Q5BJF2
Residue:
176
  
Inhibitor
Name:
BDBM50232742
Synonyms:
CHEMBL4065699 | US11046670, Table 6.4
Type:
Small organic molecule
Emp. Form.:
C28H35N3O4
Mol. Mass.:
477.5952
SMILES:
[H][C@]12C[C@@]([H])(N(CC1)C(=O)OCc1ccccc1)c1cc(ccc21)N1CCN(CCC(=O)OCC)CC1
: