Target
Sigma non-opioid intracellular receptor 1
Ligand
BDBM50232749
Substrate
Meas. Tech.
Receptor Binding Assays
Ki
413±n/a nM
Citation
 Martin, SFSahn, JJHodges, TR Piperazinyl norbenzomorphan compounds and methods for using the same US Patent  US11046670 Publication Date 6/29/2021 
Target
Name:
Sigma non-opioid intracellular receptor 1
Synonyms:
Aging-associated gene 8 protein SGMR1_HUMAN SIGMAR1 SR31747-binding protein Sigma 1-type opioid receptor Sigma1R | hSigmaR1
Type:
Enzyme Catalytic Domain
Mol. Mass.:
25124.85
Organism:
Homo sapiens (Human)
Description:
Q99720
Residue:
223
  
Inhibitor
Name:
BDBM50232749
Synonyms:
CHEMBL4095749 | US11046670, Table 6.5
Type:
Small organic molecule
Emp. Form.:
C27H33N3O2
Mol. Mass.:
431.5698
SMILES:
[H][C@]12C[C@@]([H])(N(CC1)C(=O)OCc1ccccc1)c1cc(ccc21)N1CCN(CC(C)=C)CC1
: