Target
Sigma intracellular receptor 2
Ligand
BDBM507052
Substrate
Ki
58.0±n/a nM
Citation
 Martin, SFSahn, JJHodges, TR Piperazinyl norbenzomorphan compounds and methods for using the same US Patent  US11046670 Publication Date 6/29/2021 
Target
Name:
Sigma intracellular receptor 2
Synonyms:
MAC30 S2R Sigma-2 receptor TMEM97 | Transmembrane protein 97
Type:
Protein
Mol. Mass.:
20857.20
Organism:
Homo sapiens (Human)
Description:
Q5BJF2
Residue:
176
  
Inhibitor
Name:
BDBM507052
Synonyms:
US11046670, Table 6.6
Type:
Small organic molecule
Emp. Form.:
C29H37N3O4
Mol. Mass.:
491.6218
SMILES:
CCCOC(=O)CCN1CCN(CC1)c1ccc2[C@H]3C[C@@H](N(CC3)C(=O)OCc3ccccc3)c2c1
: