Target
Toll-like receptor 8
Ligand
BDBM507046
Substrate
Meas. Tech.
Pharmacological Test
EC50
7.00±n/a nM
Citation
 Dey, FWang, LYun, HZhang, WZhang, ZZhu, W Dihydropyrimidinyl benzazepine carboxamide compounds US Patent  US11046671 Publication Date 6/29/2021 
Target
Name:
Toll-like receptor 8
Synonyms:
CD_antigen: CD288 TLR8_HUMAN | TRL8
Type:
Enzyme
Mol. Mass.:
119828.77
Organism:
Homo sapiens (Human)
Description:
Q9NR97
Residue:
1041
  
Inhibitor
Name:
BDBM507046
Synonyms:
2-Amino-8-(4,4-dimethyl-1H-quinazolin-2-yl)-N,N-dipropyl-3H-1-benzazepine-4-carboxamide | US11046671, Example 7
Type:
Small organic molecule
Emp. Form.:
C27H33N5O
Mol. Mass.:
443.5838
SMILES:
CCCN(CCC)C(=O)C1=Cc2ccc(cc2N=C(N)C1)C1=NC(C)(C)c2ccccc2N1
: