Target
Programmed cell death protein 1 [25-167,N33K], Immunoglobulin heavy constant gamma 1 [99-330,C104S,C109S,C112S,L118I,P121S]/Programmed cell death 1 ligand 1 [18-239,H172E]
Ligand
BDBM507125
Substrate
Meas. Tech.
Homogenous Time-Resolved Fluorescence (HTRF) Binding Assay
IC50
5750±n/a nM
Citation
 Yeung, KSt. Laurent, DRRomine, JLScola, PM Substituted isoquionline derivatives as immunomudulators US Patent  US11046675 Publication Date 6/29/2021 
Target
Name:
Programmed cell death protein 1 [25-167,N33K], Immunoglobulin heavy constant gamma 1 [99-330,C104S,C109S,C112S,L118I,P121S]/Programmed cell death 1 ligand 1 [18-239,H172E]
Synonyms:
PD-1/PD-L
Type:
Protein
Mol. Mass.:
Description:
Components:
This complex has 2 components.
Component 1
Name:
Programmed cell death protein 1 [25-167,N33K], Immunoglobulin heavy constant gamma 1 [99-330,C104S,C109S,C112S,L118I,P121S]
Synonyms:
Complex of Programmed cell death protein 1 [25-167,N33K] and Immunoglobulin heavy constant gamma 1 [99-330,C104S,C109S,C112S,L118I,P121S] | hPD1(25-167)-3S-IG
Type:
Enzyme Catalytic Domain
Mol. Mass.:
42672.97
Organism:
Homo sapiens (Human)
Description:
Q15116[25-167,N33K],P01857[99-330,C104S,C109S,C112S,L118I,P121S]
Residue:
384
  
Component 2
Name:
Programmed cell death 1 ligand 1 [18-239,H172E]
Synonyms:
B7H1 PD1L1_HUMAN PDCD1LG1 hPDL1(18-239)-TVMV-His
Type:
Enzyme Catalytic Domain
Mol. Mass.:
27269.94
Organism:
Homo sapiens (Human)
Description:
Q9NZQ7[18-239,H172E]
Residue:
238
  
Inhibitor
Name:
BDBM507125
Synonyms:
US11046675, Example 1004
Type:
Small organic molecule
Emp. Form.:
C26H25NO5
Mol. Mass.:
431.4804
SMILES:
Cc1c(COc2ccc3C[C@@H](NCc3c2)C(O)=O)cccc1-c1ccc2OCCOc2c1
: