Target
Interleukin-1 receptor-associated kinase 4
Ligand
BDBM507694
Substrate
Meas. Tech.
IRAK4 Biochemical Assay
IC50
<1.000±n/a nM
Citation
 Ammann, SBacon, EMBrizgys, GChin, EChou, CCottell, JJNdukwe, MShatskikh, MTaylor, JGWright, NEYang, ZZipfel, SM Thiadiazole IRAK4 compounds US Patent  US11046686 Publication Date 6/29/2021 
Target
Name:
Interleukin-1 receptor-associated kinase 4
Synonyms:
IRAK-4 IRAK4_HUMAN Interleukin-1 receptor-associated kinase 4 (IRAK4) | Renal carcinoma antigen NY-REN-64
Type:
Protein
Mol. Mass.:
51519.08
Organism:
Homo sapiens (Human)
Description:
Q9NWZ3
Residue:
460
  
Inhibitor
Name:
BDBM507694
Synonyms:
5-(6-(3- cyanopyrrolo[1,2- b]pyridazin-7-yl)-4- (isopropylamino)pyridin- 3-yl)-N-(3-(piperidin- 1-yl)propyl)-1,3,4- thiadiazole-2- carboxamide US11702414, Example 11
Type:
Small organic molecule
Emp. Form.:
C27H31N9OS
Mol. Mass.:
529.66
SMILES:
CC(C)Nc1cc(ncc1-c1nnc(s1)C(=O)NCCCN1CCCCC1)-c1ccc2cc(cnn12)C#N
: