Target
Estrogen receptor
Ligand
BDBM361453
Substrate
Meas. Tech.
ERalpha Binding Assay
IC50
0.780±n/a nM
Citation
 Nissink, JWScott, JSMoss, TAHughes, SJBarlaam, BCYang, B Selective estrogen receptor down-regulators US Patent  US11046689 Publication Date 6/29/2021 
Target
Name:
Estrogen receptor
Synonyms:
ER ESR ESR1_HUMAN Estrogen receptor Estrogen receptor (ER-alpha) Estrogen receptor alpha (ER) Nuclear receptor subfamily 3 group A member 1
Type:
Protein
Mol. Mass.:
66230.44
Organism:
Homo sapiens (Human)
Description:
P03372
Residue:
595
  
Inhibitor
Name:
BDBM361453
Synonyms:
2,2-difluoro-3- ((1R,3R)-1-(6- fluoro-3-(2- ((3- fluoropropyl) amino)ethoxy)- 2- methylphenyl)- 3-methyl- 1,3,4,9- tetrahydro-2H- pyrido[3,4- b]indol-2- yl)propan-1-ol US10590132, Example 45 | US11046689, Example 45
Type:
Small organic molecule
Emp. Form.:
C27H33F4N3O2
Mol. Mass.:
507.5634
SMILES:
C[C@@H]1Cc2c([nH]c3ccccc23)[C@H](N1CC(F)(F)CO)c1c(F)ccc(OCCNCCCF)c1C
: