Target
Estrogen receptor
Ligand
BDBM361457
Substrate
Meas. Tech.
ERalpha Binding Assay
IC50
1.20±n/a nM
Citation
 Nissink, JWScott, JSMoss, TAHughes, SJBarlaam, BCYang, B Selective estrogen receptor down-regulators US Patent  US11046689 Publication Date 6/29/2021 
Target
Name:
Estrogen receptor
Synonyms:
ER ESR ESR1_HUMAN Estrogen receptor Estrogen receptor (ER-alpha) Estrogen receptor alpha (ER) Nuclear receptor subfamily 3 group A member 1
Type:
Protein
Mol. Mass.:
66230.44
Organism:
Homo sapiens (Human)
Description:
P03372
Residue:
595
  
Inhibitor
Name:
BDBM361457
Synonyms:
2,2-difluoro-3- ((1R,3R)-1-(5- ((S)-2-((3- fluoropropyl) amino)propoxy)- 2- methoxyphenyl)- 3-methyl- 1,3,4,9- tetrahydro-2H- pyrido[3,4- b]indol-2- yl)propan-1-ol US10590132, Example 49 | US11046689, Example 49
Type:
Small organic molecule
Emp. Form.:
C28H36F3N3O3
Mol. Mass.:
519.5989
SMILES:
COc1ccc(OC[C@H](C)NCCCF)cc1[C@H]1N(CC(F)(F)CO)[C@H](C)Cc2c1[nH]c1ccccc21
: