Target
Estrogen receptor
Ligand
BDBM361459
Substrate
Meas. Tech.
ERalpha Binding Assay
IC50
1.20±n/a nM
Citation
 Nissink, JWScott, JSMoss, TAHughes, SJBarlaam, BCYang, B Selective estrogen receptor down-regulators US Patent  US11046689 Publication Date 6/29/2021 
Target
Name:
Estrogen receptor
Synonyms:
ER ESR ESR1_HUMAN Estrogen receptor Estrogen receptor (ER-alpha) Estrogen receptor alpha (ER) Nuclear receptor subfamily 3 group A member 1
Type:
Protein
Mol. Mass.:
66230.44
Organism:
Homo sapiens (Human)
Description:
P03372
Residue:
595
  
Inhibitor
Name:
BDBM361459
Synonyms:
N-(2-(3- ((1R,3R)-2- (2,2- difluoroethyl)- 3-methyl- 2,3,4,9- tetrahydro-1H- pyrido[3,4- b]indol-1-yl)- 2,4- difluorophenoxy) ethyl)-3- fluoropropan- 1-amine US10590132, Example 51 | US11046689, Example 51
Type:
Small organic molecule
Emp. Form.:
C25H28F5N3O
Mol. Mass.:
481.5013
SMILES:
C[C@@H]1Cc2c([nH]c3ccccc23)[C@H](N1CC(F)F)c1c(F)ccc(OCCNCCCF)c1F
: