Target
Estrogen receptor
Ligand
BDBM361495
Substrate
Meas. Tech.
ERalpha Binding Assay
IC50
0.540±n/a nM
Citation
 Nissink, JWScott, JSMoss, TAHughes, SJBarlaam, BCYang, B Selective estrogen receptor down-regulators US Patent  US11046689 Publication Date 6/29/2021 
Target
Name:
Estrogen receptor
Synonyms:
ER ESR ESR1_HUMAN Estrogen receptor Estrogen receptor (ER-alpha) Estrogen receptor alpha (ER) Nuclear receptor subfamily 3 group A member 1
Type:
Protein
Mol. Mass.:
66230.44
Organism:
Homo sapiens (Human)
Description:
P03372
Residue:
595
  
Inhibitor
Name:
BDBM361495
Synonyms:
3-((1R,3R)-1- (6-fluoro-3-(2- ((3- fluoropropyl) amino)ethoxy)- 2- methylphenyl)- 3-methyl- 1,3,4,9- tetrahydro-2H- pyrido[3,4- b]indol-2- yl)propanenitrile US10590132, Example 87 | US11046689, Example 87
Type:
Small organic molecule
Emp. Form.:
C27H32F2N4O
Mol. Mass.:
466.566
SMILES:
C[C@@H]1Cc2c([nH]c3ccccc23)[C@H](N1CCC#N)c1c(F)ccc(OCCNCCCF)c1C
: