Target
Estrogen receptor
Ligand
BDBM361512
Substrate
Meas. Tech.
ERalpha Binding Assay
IC50
0.720±n/a nM
Citation
 Nissink, JWScott, JSMoss, TAHughes, SJBarlaam, BCYang, B Selective estrogen receptor down-regulators US Patent  US11046689 Publication Date 6/29/2021 
Target
Name:
Estrogen receptor
Synonyms:
ER ESR ESR1_HUMAN Estrogen receptor Estrogen receptor (ER-alpha) Estrogen receptor alpha (ER) Nuclear receptor subfamily 3 group A member 1
Type:
Protein
Mol. Mass.:
66230.44
Organism:
Homo sapiens (Human)
Description:
P03372
Residue:
595
  
Inhibitor
Name:
BDBM361512
Synonyms:
3-((1R,3R)-1- (3-chloro-2-(2- ((3- fluoropropyl) amino)ethoxy) pyridin-4-yl)-3- methyl- 1,3,4,9- tetrahydro-2H- pyrido[3,4- b]indol-2-yl)- 2,2- difluoropropan- 1-ol US10590132, Example 104 | US11046689, Example 104
Type:
Small organic molecule
Emp. Form.:
C25H30ClF3N4O2
Mol. Mass.:
510.98
SMILES:
C[C@@H]1Cc2c([nH]c3ccccc23)[C@H](N1CC(F)(F)CO)c1ccnc(OCCNCCCF)c1Cl
: