Target
Estrogen receptor
Ligand
BDBM361517
Substrate
Meas. Tech.
ERalpha Binding Assay
IC50
1.20±n/a nM
Citation
 Nissink, JWScott, JSMoss, TAHughes, SJBarlaam, BCYang, B Selective estrogen receptor down-regulators US Patent  US11046689 Publication Date 6/29/2021 
Target
Name:
Estrogen receptor
Synonyms:
ER ESR ESR1_HUMAN Estrogen receptor Estrogen receptor (ER-alpha) Estrogen receptor alpha (ER) Nuclear receptor subfamily 3 group A member 1
Type:
Protein
Mol. Mass.:
66230.44
Organism:
Homo sapiens (Human)
Description:
P03372
Residue:
595
  
Inhibitor
Name:
BDBM361517
Synonyms:
N-(2-((3,5- difluoro-4- ((1R,3R)-6- fluoro-2-((1- fluorocyclopropyl) methyl)-3- methyl- 2,3,4,9- tetrahydro-1H- pyrido[3,4- b]indol-1- yl)pyridin-2- yl)oxy)ethyl)- 3- fluoropropan- 1-amine US10590132, Example 109 | US11046689, Example 109
Type:
Small organic molecule
Emp. Form.:
C26H29F5N4O
Mol. Mass.:
508.5267
SMILES:
C[C@@H]1Cc2c([nH]c3ccc(F)cc23)[C@H](N1CC1(F)CC1)c1c(F)cnc(OCCNCCCF)c1F
: