Target
Estrogen receptor
Ligand
BDBM361556
Substrate
Meas. Tech.
ERalpha Binding Assay
IC50
1.10±n/a nM
Citation
 Nissink, JWScott, JSMoss, TAHughes, SJBarlaam, BCYang, B Selective estrogen receptor down-regulators US Patent  US11046689 Publication Date 6/29/2021 
Target
Name:
Estrogen receptor
Synonyms:
ER ESR ESR1_HUMAN Estrogen receptor Estrogen receptor (ER-alpha) Estrogen receptor alpha (ER) Nuclear receptor subfamily 3 group A member 1
Type:
Protein
Mol. Mass.:
66230.44
Organism:
Homo sapiens (Human)
Description:
P03372
Residue:
595
  
Inhibitor
Name:
BDBM361556
Synonyms:
(S)-3-((1R,3R)- 1-(2- (difluoromethyl)- 6-fluoro-3- (2-((3- fluoropropyl) (methyl)amino) ethoxy)phenyl)- 3-methyl- 1,3,4,9- tetrahydro-2H- pyrido[3,4- b]indol-2-yl)- 2- methylpropanoic acid US10590132, Example 148 | US11046689, Example 148
Type:
Small organic molecule
Emp. Form.:
C29H35F4N3O3
Mol. Mass.:
549.6001
SMILES:
C[C@@H](CN1[C@H](C)Cc2c([nH]c3ccccc23)[C@H]1c1c(F)ccc(OCCN(C)CCCF)c1C(F)F)C(O)=O
: