Target
Estrogen receptor
Ligand
BDBM361564
Substrate
Meas. Tech.
ERalpha Binding Assay
IC50
1.20±n/a nM
Citation
 Nissink, JWScott, JSMoss, TAHughes, SJBarlaam, BCYang, B Selective estrogen receptor down-regulators US Patent  US11046689 Publication Date 6/29/2021 
Target
Name:
Estrogen receptor
Synonyms:
ER ESR ESR1_HUMAN Estrogen receptor Estrogen receptor (ER-alpha) Estrogen receptor alpha (ER) Nuclear receptor subfamily 3 group A member 1
Type:
Protein
Mol. Mass.:
66230.44
Organism:
Homo sapiens (Human)
Description:
P03372
Residue:
595
  
Inhibitor
Name:
BDBM361564
Synonyms:
Preparation of 3-((1R,3R)-6-fluoro-1-(5-fluoro-2-(2-((3-fluoropropyl)(methyl)amino)ethoxy)-3-methylpyridin-4-yl)-3-methyl-1,3,4,9-tetrahydro-2H-pyrido[3,4-b]indol-2-yl)propanoic acid US10590132, Example 156 | US11046689, Example 156
Type:
Small organic molecule
Emp. Form.:
C27H33F3N4O3
Mol. Mass.:
518.5711
SMILES:
C[C@@H]1Cc2c([nH]c3ccc(F)cc23)[C@H](N1CCC(O)=O)c1c(F)cnc(OCCN(C)CCCF)c1C
: