Target
Protein O-GlcNAcase
Ligand
BDBM408230
Substrate
Meas. Tech.
Human O-GlcNAcase Enzyme Inhibition Assay
IC50
<50±n/a nM
Citation
 Quattropani, AKulkarni, SSGiri, AG Glycosidase inhibitors US Patent  US11046712 Publication Date 6/29/2021 
Target
Name:
Protein O-GlcNAcase
Synonyms:
2-acetamido-2-deoxy-β-D-glucopyranosidase (O-GlcNAcase) Beta-hexosaminidase (O-GlcNAcase) HEXC MEA5 N-acetyl-beta-D-glucosaminidase (O-GlcNAcase) OGA Protein O-GlcNAcase
Type:
Enzyme
Mol. Mass.:
102874.67
Organism:
Homo sapiens (Human)
Description:
O60502
Residue:
916
  
Inhibitor
Name:
BDBM408230
Synonyms:
(S) 2-(4-(1-(benzo[d][1,3]dioxol-5-yl)ethyl)piperazin-1-yl)-N-methylpyrimidine-5-carboxamide US11046712, No 134
Type:
Small organic molecule
Emp. Form.:
C19H23N5O3
Mol. Mass.:
369.4176
SMILES:
CNC(=O)c1cnc(nc1)N1CCN(CC1)[C@@H](C)c1ccc2OCOc2c1
: