Target
Adenosine receptor A2a
Ligand
BDBM508592
Substrate
Meas. Tech.
competition binding assay
Ki
1.70±n/a nM
Citation
 Amjad, AGallo, GVHenderson, TJKuang, RLim, YLo, MMMetzger, Ede Lera Ruiz, MStamford, ATempest, PWhitehead, BWu, H 2,2-difluorodioxolo A2A receptor antagonists US Patent  US11046714 Publication Date 6/29/2021 
Target
Name:
Adenosine receptor A2a
Synonyms:
A2A adenosine receptor (hA2A) ADENOSINE A2 ADORA2 Adenosine A2A receptor (A2AAR)
Type:
G Protein-Coupled Receptor (GPCR)
Mol. Mass.:
44716.46
Organism:
Homo sapiens (Human)
Description:
P29274
Residue:
412
  
Inhibitor
Name:
BDBM508592
Synonyms:
4-[2-(5-amino-2,2-difluoro[1,3] dioxolo[4,5-h][1,2,4]triazolo [1,5-c]quinazolin-8-yl)ethyl]-1- methylpiperazin-2-one | US11046714, Example 47
Type:
Small organic molecule
Emp. Form.:
C17H17F2N7O3
Mol. Mass.:
405.3588
SMILES:
CN1CCN(CCc2nc3c4ccc5OC(F)(F)Oc5c4nc(N)n3n2)CC1=O
: