Target
Fibroblast growth factor receptor 3
Ligand
BDBM302400
Substrate
IC50
1.20±n/a nM
Citation
 Collin, MBrohm, DHéroult, MLobell, MHübsch, WLustig, KGrünewald, SBömer, UVöhringer, VLindner, N Substituted benzothienyl-pyrrolotriazines and uses thereof in the treatment cancer US Patent  US9598416 Publication Date 3/21/2017 
Target
Name:
Fibroblast growth factor receptor 3
Synonyms:
CD_antigen: CD333 FGFR3 Fibroblast growth factor receptor JTK4
Type:
Protein
Mol. Mass.:
87699.57
Organism:
Homo sapiens (Human)
Description:
P22607
Residue:
806
  
Inhibitor
Name:
BDBM302400
Synonyms:
US9598416, Example 46
Type:
Small organic molecule
Emp. Form.:
C21H22N6OS
Mol. Mass.:
406.504
SMILES:
COc1cc(C)cc2cc(sc12)-c1c(CN(C)CCC#N)cn2ncnc(N)c12
: