Target
Fibroblast growth factor receptor 3
Ligand
BDBM302427
Substrate
IC50
2.30±n/a nM
Citation
 Collin, MBrohm, DHéroult, MLobell, MHübsch, WLustig, KGrünewald, SBömer, UVöhringer, VLindner, N Substituted benzothienyl-pyrrolotriazines and uses thereof in the treatment cancer US Patent  US9598416 Publication Date 3/21/2017 
Target
Name:
Fibroblast growth factor receptor 3
Synonyms:
CD_antigen: CD333 FGFR3 Fibroblast growth factor receptor JTK4
Type:
Protein
Mol. Mass.:
87699.57
Organism:
Homo sapiens (Human)
Description:
P22607
Residue:
806
  
Inhibitor
Name:
BDBM302427
Synonyms:
US9598416, Example 73
Type:
Small organic molecule
Emp. Form.:
C21H23N5O2S
Mol. Mass.:
409.505
SMILES:
COc1cc(C)cc2cc(sc12)-c1c(CNC2CCOC2)cn2ncnc(N)c12
: