Target
Kinesin-like protein KIF11
Ligand
BDBM509093
Substrate
Meas. Tech.
Inhibition Assay
IC50
0.457±n/a nM
Citation
 Lerchen, HRebstock, ACancho Grande, YWittrock, SBerndt, SGritzan, UFitting, JStelte-Ludwig, BJones, PMahlert, CVotsmeier, CSchönfeld, DTrautwein, MWeber, EPawlowski, NGreven, SGlück, JMHammer, SDietz, LMärsch, S Antibody drug conjugates of kinesin spindel protein (KSP) inhibitors with antiB7H3-antibodies US Patent  US11071788 Publication Date 7/27/2021 
Target
Name:
Kinesin-like protein KIF11
Synonyms:
EG5 KIF11_HUMAN Kinesin Spindle Protein Eg5 TRIP5 | kinesin spindle protein
Type:
PROTEIN
Mol. Mass.:
119138.97
Organism:
Homo sapiens (Human)
Description:
ChEMBL_1457426
Residue:
1056
  
Inhibitor
Name:
BDBM509093
Synonyms:
(3R,7S)-7-Amino-17-{[(2R)-2-amino-2-carboxyethyl]sulphanyl}-3-[1-benzyl-4-(2,5-difluorophenyl)-1H-pyrrol-2-yl]-4-glycoloyl-2,2-dimethyl-8,16-dioxo-12-oxa-4,9,15-triazanonadecan-19-oic acid/trifluoroacetic acid (1:1) | US11071788, Example M5
Type:
Small organic molecule
Emp. Form.:
C39H52F2N6O9S
Mol. Mass.:
818.927
SMILES:
CC(C)(C)[C@@H](N(CC[C@H](N)C(=O)NCCOCCNC(=O)CC(SC[C@H](N)C(O)=O)C(O)=O)C(=O)CO)c1cc(cn1Cc1ccccc1)-c1cc(F)ccc1F
: