Target
Kinesin-like protein KIF11
Ligand
BDBM509095
Substrate
Meas. Tech.
Inhibition Assay
IC50
0.621±n/a nM
Citation
 Lerchen, HRebstock, ACancho Grande, YWittrock, SBerndt, SGritzan, UFitting, JStelte-Ludwig, BJones, PMahlert, CVotsmeier, CSchönfeld, DTrautwein, MWeber, EPawlowski, NGreven, SGlück, JMHammer, SDietz, LMärsch, S Antibody drug conjugates of kinesin spindel protein (KSP) inhibitors with antiB7H3-antibodies US Patent  US11071788 Publication Date 7/27/2021 
Target
Name:
Kinesin-like protein KIF11
Synonyms:
EG5 KIF11_HUMAN Kinesin Spindle Protein Eg5 TRIP5 | kinesin spindle protein
Type:
PROTEIN
Mol. Mass.:
119138.97
Organism:
Homo sapiens (Human)
Description:
ChEMBL_1457426
Residue:
1056
  
Inhibitor
Name:
BDBM509095
Synonyms:
S-(2-{[2-({(2S)-2-Amino-4-[{(1R)-1-[1-benzyl-4-(2,5-difluorophenyl)-1H-pyrrol-2-yl]-2,2-dimethylpropyl}(glycoloyl)amino]butanoyl}amino)ethyl]amino}-2-oxoethyl)-L-cysteine/trifluoroacetic acid (1:1) | US11071788, Example M7
Type:
Small organic molecule
Emp. Form.:
C35H46F2N6O6S
Mol. Mass.:
716.838
SMILES:
CC(C)(C)[C@@H](N(CC[C@H](N)C(=O)NCCNC(=O)CSC[C@H](N)C(O)=O)C(=O)CO)c1cc(cn1Cc1ccccc1)-c1cc(F)ccc1F
: