Target
Kinesin-like protein KIF11
Ligand
BDBM509097
Substrate
Meas. Tech.
Inhibition Assay
IC50
0.470±n/a nM
Citation
 Lerchen, HRebstock, ACancho Grande, YWittrock, SBerndt, SGritzan, UFitting, JStelte-Ludwig, BJones, PMahlert, CVotsmeier, CSchönfeld, DTrautwein, MWeber, EPawlowski, NGreven, SGlück, JMHammer, SDietz, LMärsch, S Antibody drug conjugates of kinesin spindel protein (KSP) inhibitors with antiB7H3-antibodies US Patent  US11071788 Publication Date 7/27/2021 
Target
Name:
Kinesin-like protein KIF11
Synonyms:
EG5 KIF11_HUMAN Kinesin Spindle Protein Eg5 TRIP5 | kinesin spindle protein
Type:
PROTEIN
Mol. Mass.:
119138.97
Organism:
Homo sapiens (Human)
Description:
ChEMBL_1457426
Residue:
1056
  
Inhibitor
Name:
BDBM509097
Synonyms:
(2R,28R)-28-Amino-2-[({2-[(3-aminopropyl){(1R)-1-[1-benzyl-4-(2,5-difluorophenyl)-1H-pyrrol-2-yl]-2,2-dimethylpropyl}amino]-2-oxoethyl}sulphanyl)methyl]-25-(carboxymethyl)-4,20,24-trioxo-7,10,13,16-tetraoxa-26-thia-3,19,23-triazanonacosan-1,29-dioic acid/trifluoroacetic acid (1:2) | US11071788, Example M10
Type:
Small organic molecule
Emp. Form.:
C51H73F2N7O14S2
Mol. Mass.:
1110.291
SMILES:
CC(C)(C)[C@@H](N(CCCN)C(=O)CSC[C@H](NC(=O)CCOCCOCCOCCOCCNC(=O)CCNC(=O)CC(SC[C@H](N)C(O)=O)C(O)=O)C(O)=O)c1cc(cn1Cc1ccccc1)-c1cc(F)ccc1F
: