Target
Kinesin-like protein KIF11
Ligand
BDBM509107
Substrate
Meas. Tech.
Inhibition Assay
IC50
0.827±n/a nM
Citation
 Lerchen, HRebstock, ACancho Grande, YWittrock, SBerndt, SGritzan, UFitting, JStelte-Ludwig, BJones, PMahlert, CVotsmeier, CSchönfeld, DTrautwein, MWeber, EPawlowski, NGreven, SGlück, JMHammer, SDietz, LMärsch, S Antibody drug conjugates of kinesin spindel protein (KSP) inhibitors with antiB7H3-antibodies US Patent  US11071788 Publication Date 7/27/2021 
Target
Name:
Kinesin-like protein KIF11
Synonyms:
EG5 KIF11_HUMAN Kinesin Spindle Protein Eg5 TRIP5 | kinesin spindle protein
Type:
PROTEIN
Mol. Mass.:
119138.97
Organism:
Homo sapiens (Human)
Description:
ChEMBL_1457426
Residue:
1056
  
Inhibitor
Name:
BDBM509107
Synonyms:
(1R,4R,27R,33R)-1-Amino-32-(3-aminopropyl)-33-[1-benzyl-4-(2,5-difluorophenyl)-1H-pyrrol-2-yl]-34,34-dimethyl-6,9,25,31-tetraoxo-13,16,19,22-tetraoxa-3,29-dithia-7,10,26,32-tetraazapentatriacontane-1,4,27-tricarboxylic acid/trifluoroacetic acid (1:2) US11071788, Example M22
Type:
Small organic molecule
Emp. Form.:
C50H71F2N7O14S2
Mol. Mass.:
1096.264
SMILES:
CC(C)(C)[C@@H](N(CCCN)C(=O)CSC[C@H](NC(=O)CCOCCOCCOCCOCCNC(=O)CNC(=O)CC(SC[C@H](N)C(O)=O)C(O)=O)C(O)=O)c1cc(cn1Cc1ccccc1)-c1cc(F)ccc1F
: