Target
Ectonucleotide pyrophosphatase/phosphodiesterase family member 2
Ligand
BDBM192921
Substrate
Meas. Tech.
In Vitro Assay
IC50
>1000±n/a nM
Citation
 Desroy, NHeckmann, BBrys, RCJoncour, AMPeixoto, CBock, XM Compounds and pharmaceutical compositions thereof for the treatment of inflammatory disorders US Patent  US11072611 Publication Date 7/27/2021 
Target
Name:
Ectonucleotide pyrophosphatase/phosphodiesterase family member 2
Synonyms:
ATX Autotaxin (ATX) ENPP2 Ectonucleotide Pyrophosphatase/Phosphodiesterase 2 (ENPP2) Extracellular lysophospholipase D PDNP2
Type:
Enzyme
Mol. Mass.:
99007.13
Organism:
Homo sapiens (Human)
Description:
Q13822
Residue:
863
  
Inhibitor
Name:
BDBM192921
Synonyms:
US10526329, Compound 135 US9670204, 135 5-bromo-N-(2-ethyl-6-(1-(methylsulfonyl)piperidin-4-yl)imidazo[1,2-a]pyridin-3-yl)-4-(4-fluorophenyl)-N-methylthiazol-2-amine
Type:
Small organic molecule
Emp. Form.:
C25H27BrFN5O2S2
Mol. Mass.:
592.547
SMILES:
CCc1nc2ccc(cn2c1N(C)c1nc(c(Br)s1)-c1ccc(F)cc1)C1CCN(CC1)S(C)(=O)=O
: