Target
Pantetheinase [22-493]
Ligand
BDBM510525
Substrate
Meas. Tech.
Enzymatic Assay
IC50
0.400±n/a nM
Citation
 Fleck, MTGodbout, CKoolman, HF Heteroaromatic compounds as Vanin inhibitors US Patent  US11078182 Publication Date 8/3/2021 
Target
Name:
Pantetheinase [22-493]
Synonyms:
Pantetheinase (VNN1)(22-493) VNN1_HUMAN
Type:
Enzyme Catalytic Domain
Mol. Mass.:
52490.93
Organism:
Homo sapiens (Human)
Description:
aa 22-493
Residue:
472
  
Inhibitor
Name:
BDBM510525
Synonyms:
US11078182, Ex. 1.11
Type:
Small organic molecule
Emp. Form.:
C22H27FN4O2
Mol. Mass.:
398.4738
SMILES:
CN([C@H]1CCN(C1)C(=O)c1ccc(NC(C)(C)C)nc1)C(=O)c1ccc(F)cc1
: