Target
Pantetheinase [22-493]
Ligand
BDBM510528
Substrate
Meas. Tech.
Enzymatic Assay
IC50
0.800±n/a nM
Citation
 Fleck, MTGodbout, CKoolman, HF Heteroaromatic compounds as Vanin inhibitors US Patent  US11078182 Publication Date 8/3/2021 
Target
Name:
Pantetheinase [22-493]
Synonyms:
Pantetheinase (VNN1)(22-493) VNN1_HUMAN
Type:
Enzyme Catalytic Domain
Mol. Mass.:
52490.93
Organism:
Homo sapiens (Human)
Description:
aa 22-493
Residue:
472
  
Inhibitor
Name:
BDBM510528
Synonyms:
US11078182, Ex. 1.14
Type:
Small organic molecule
Emp. Form.:
C19H28N4O2
Mol. Mass.:
344.4512
SMILES:
CC(C)(C)Nc1ccc(cn1)C(=O)N1CC[C@@H](C1)N1CCCCC1=O
: