Target
Pantetheinase [22-493]
Ligand
BDBM510534
Substrate
Meas. Tech.
Enzymatic Assay
IC50
1.70±n/a nM
Citation
 Fleck, MTGodbout, CKoolman, HF Heteroaromatic compounds as Vanin inhibitors US Patent  US11078182 Publication Date 8/3/2021 
Target
Name:
Pantetheinase [22-493]
Synonyms:
Pantetheinase (VNN1)(22-493) VNN1_HUMAN
Type:
Enzyme Catalytic Domain
Mol. Mass.:
52490.93
Organism:
Homo sapiens (Human)
Description:
aa 22-493
Residue:
472
  
Inhibitor
Name:
BDBM510534
Synonyms:
US11078182, Ex. 2.4
Type:
Small organic molecule
Emp. Form.:
C21H30N4O2
Mol. Mass.:
370.4885
SMILES:
CC1(CCCCC1)Nc1ccc(cn1)C(=O)N1CC[C@@H](C1)N1CCCC1=O
: