Target
Pantetheinase [22-493]
Ligand
BDBM510542
Substrate
Meas. Tech.
Enzymatic Assay
IC50
1.20±n/a nM
Citation
 Fleck, MTGodbout, CKoolman, HF Heteroaromatic compounds as Vanin inhibitors US Patent  US11078182 Publication Date 8/3/2021 
Target
Name:
Pantetheinase [22-493]
Synonyms:
Pantetheinase (VNN1)(22-493) VNN1_HUMAN
Type:
Enzyme Catalytic Domain
Mol. Mass.:
52490.93
Organism:
Homo sapiens (Human)
Description:
aa 22-493
Residue:
472
  
Inhibitor
Name:
BDBM510542
Synonyms:
US11078182, Ex. 4.2
Type:
Small organic molecule
Emp. Form.:
C21H34N6O2
Mol. Mass.:
402.5337
SMILES:
CN([C@H]1CCN(C1)C(=O)c1ccc(NC(C)(C)C)nc1)C(=O)N1CCN(C)CC1
: