Target
Pantetheinase [22-493]
Ligand
BDBM510545
Substrate
Meas. Tech.
Enzymatic Assay
IC50
0.300±n/a nM
Citation
 Fleck, MTGodbout, CKoolman, HF Heteroaromatic compounds as Vanin inhibitors US Patent  US11078182 Publication Date 8/3/2021 
Target
Name:
Pantetheinase [22-493]
Synonyms:
Pantetheinase (VNN1)(22-493) VNN1_HUMAN
Type:
Enzyme Catalytic Domain
Mol. Mass.:
52490.93
Organism:
Homo sapiens (Human)
Description:
aa 22-493
Residue:
472
  
Inhibitor
Name:
BDBM510545
Synonyms:
US11078182, Ex. 7
Type:
Small organic molecule
Emp. Form.:
C16H22N4O
Mol. Mass.:
286.3721
SMILES:
CC(C)(C)Nc1ccc(cn1)C(=O)N1CCC(C)(C1)C#N
: