Target
Pantetheinase [22-493]
Ligand
BDBM510546
Substrate
Meas. Tech.
Enzymatic Assay
IC50
0.300±n/a nM
Citation
 Fleck, MTGodbout, CKoolman, HF Heteroaromatic compounds as Vanin inhibitors US Patent  US11078182 Publication Date 8/3/2021 
Target
Name:
Pantetheinase [22-493]
Synonyms:
Pantetheinase (VNN1)(22-493) VNN1_HUMAN
Type:
Enzyme Catalytic Domain
Mol. Mass.:
52490.93
Organism:
Homo sapiens (Human)
Description:
aa 22-493
Residue:
472
  
Inhibitor
Name:
BDBM510546
Synonyms:
N-tert-Butyl-5-[3-methyl-3-(pyridin-2-yl)azetidine-1-carbonyl]pyridin-2-amine | US11078182, Ex. 8
Type:
Small organic molecule
Emp. Form.:
C19H24N4O
Mol. Mass.:
324.4201
SMILES:
CC(C)(C)Nc1ccc(cn1)C(=O)N1CC(C)(C1)c1ccccn1
: