Target
Fibroblast growth factor receptor 1
Ligand
BDBM286999
Substrate
Meas. Tech.
Enzymatic Activity Assay
IC50
0.900±n/a nM
Citation
 Verner, EBrameld, KA Quinolone derivatives as fibroblast growth factor receptor inhibitors US Patent  US11078199 Publication Date 8/3/2021 
Target
Name:
Fibroblast growth factor receptor 1
Synonyms:
BFGFR Basic fibroblast growth factor receptor 1 (FGFR1) CEK FGFR-1 FGFR-1, (FL) FGFR1_HUMAN FLT2 Fibroblast growth factor receptor 1 (FGFR-1) Fms-like tyrosine kinase 2 N-sam bFGF-R | c-fgr
Type:
Receptor
Mol. Mass.:
91861.70
Organism:
Homo sapiens (Human)
Description:
P11362
Residue:
822
  
Inhibitor
Name:
BDBM286999
Synonyms:
8-((1-((4-acryloylpiperazin-1-yl)methyl)cyclopropyl)methyl)-6-(2,6-dichloro-3,5-dimethoxyphenyl)-2-(methylamino)pyrido[2,3-d]pyrimidin-7(8H)-one US11078199, Cpd 27 US9815834, Compound 27
Type:
Small organic molecule
Emp. Form.:
C28H32Cl2N6O4
Mol. Mass.:
587.497
SMILES:
CNc1ncc2cc(-c3c(Cl)c(OC)cc(OC)c3Cl)c(=O)n(CC3(CN4CCN(CC4)C(=O)C=C)CC3)c2n1
: