Target
Fibroblast growth factor receptor 1
Ligand
BDBM287005
Substrate
Meas. Tech.
Enzymatic Activity Assay
IC50
0.600±n/a nM
Citation
 Verner, EBrameld, KA Quinolone derivatives as fibroblast growth factor receptor inhibitors US Patent  US11078199 Publication Date 8/3/2021 
Target
Name:
Fibroblast growth factor receptor 1
Synonyms:
BFGFR Basic fibroblast growth factor receptor 1 (FGFR1) CEK FGFR-1 FGFR-1, (FL) FGFR1_HUMAN FLT2 Fibroblast growth factor receptor 1 (FGFR-1) Fms-like tyrosine kinase 2 N-sam bFGF-R | c-fgr
Type:
Receptor
Mol. Mass.:
91861.70
Organism:
Homo sapiens (Human)
Description:
P11362
Residue:
822
  
Inhibitor
Name:
BDBM287005
Synonyms:
8-(3-(4-acryloylpiperazin-1-yl)propyl)-6-(2,6-dichloro-3,5-dimethoxyphenyl)-2-((2-hydroxyethyl)amino)pyrido[2,3-d]pyrimidin-7(8H)-one US11078199, Cpd 13 US9815834, Compound 13
Type:
Small organic molecule
Emp. Form.:
C27H32Cl2N6O5
Mol. Mass.:
591.486
SMILES:
COc1cc(OC)c(Cl)c(c1Cl)-c1cc2cnc(NCCO)nc2n(CCCN2CCN(CC2)C(=O)C=C)c1=O
: