Target
Fibroblast growth factor receptor 1
Ligand
BDBM287012
Substrate
Meas. Tech.
Enzymatic Activity Assay
IC50
1.000±n/a nM
Citation
 Verner, EBrameld, KA Quinolone derivatives as fibroblast growth factor receptor inhibitors US Patent  US11078199 Publication Date 8/3/2021 
Target
Name:
Fibroblast growth factor receptor 1
Synonyms:
BFGFR Basic fibroblast growth factor receptor 1 (FGFR1) CEK FGFR-1 FGFR-1, (FL) FGFR1_HUMAN FLT2 Fibroblast growth factor receptor 1 (FGFR-1) Fms-like tyrosine kinase 2 N-sam bFGF-R | c-fgr
Type:
Receptor
Mol. Mass.:
91861.70
Organism:
Homo sapiens (Human)
Description:
P11362
Residue:
822
  
Inhibitor
Name:
BDBM287012
Synonyms:
8-(3-(4-acryloylpiperazin-1-yl)propyl)-6-(2,6-dichloro-3,5-dimethoxyphenyl)-2-((tetrahydro-2H-pyran-4-yl)amino)pyrido[2,3-d]pyrimidin-7(8H)-one US11078199, Cpd 37 US9815834, Compound 37
Type:
Small organic molecule
Emp. Form.:
C30H36Cl2N6O5
Mol. Mass.:
631.55
SMILES:
COc1cc(OC)c(Cl)c(c1Cl)-c1cc2cnc(NC3CCOCC3)nc2n(CCCN2CCN(CC2)C(=O)C=C)c1=O
: