Target
Fibroblast growth factor receptor 1
Ligand
BDBM287045
Substrate
Meas. Tech.
Enzymatic Activity Assay
IC50
1.20±n/a nM
Citation
 Verner, EBrameld, KA Quinolone derivatives as fibroblast growth factor receptor inhibitors US Patent  US11078199 Publication Date 8/3/2021 
Target
Name:
Fibroblast growth factor receptor 1
Synonyms:
BFGFR Basic fibroblast growth factor receptor 1 (FGFR1) CEK FGFR-1 FGFR-1, (FL) FGFR1_HUMAN FLT2 Fibroblast growth factor receptor 1 (FGFR-1) Fms-like tyrosine kinase 2 N-sam bFGF-R | c-fgr
Type:
Receptor
Mol. Mass.:
91861.70
Organism:
Homo sapiens (Human)
Description:
P11362
Residue:
822
  
Inhibitor
Name:
BDBM287045
Synonyms:
8-(3-(4-acryloylpiperazin-1-yl)propyl)-6-(2,6-dichloro-3,5-dimethoxyphenyl)-2-((2-(2-methoxyethoxy)ethyl)amino)pyrido[2,3-d]pyrimidin-7(8H)-one US11078199, Cpd 63 US9815834, Compound 63
Type:
Small organic molecule
Emp. Form.:
C30H38Cl2N6O6
Mol. Mass.:
649.565
SMILES:
COCCOCCNc1ncc2cc(-c3c(Cl)c(OC)cc(OC)c3Cl)c(=O)n(CCCN3CCN(CC3)C(=O)C=C)c2n1
: