Target
Fibroblast growth factor receptor 1
Ligand
BDBM287075
Substrate
Meas. Tech.
Enzymatic Activity Assay
IC50
1.40±n/a nM
Citation
 Verner, EBrameld, KA Quinolone derivatives as fibroblast growth factor receptor inhibitors US Patent  US11078199 Publication Date 8/3/2021 
Target
Name:
Fibroblast growth factor receptor 1
Synonyms:
BFGFR Basic fibroblast growth factor receptor 1 (FGFR1) CEK FGFR-1 FGFR-1, (FL) FGFR1_HUMAN FLT2 Fibroblast growth factor receptor 1 (FGFR-1) Fms-like tyrosine kinase 2 N-sam bFGF-R | c-fgr
Type:
Receptor
Mol. Mass.:
91861.70
Organism:
Homo sapiens (Human)
Description:
P11362
Residue:
822
  
Inhibitor
Name:
BDBM287075
Synonyms:
8-(2-((1-acryloylpiperidin-4-yl)(methyl)amino)ethyl)-6-(2,6-dichloro-3,5-dimethoxy-phenyl)-2-(ethylamino)pyrido[2,3-d]pyrimidin-7(8H)-one US9567334, Example 129
Type:
Small organic molecule
Emp. Form.:
C28H34Cl2N6O4
Mol. Mass.:
589.513
SMILES:
CCNc1ncc2cc(-c3c(Cl)c(OC)cc(OC)c3Cl)c(=O)n(CCN(C)C3CCN(CC3)C(=O)C=C)c2n1
: