Target
Fibroblast growth factor receptor 1
Ligand
BDBM287158
Substrate
Meas. Tech.
Enzymatic Activity Assay
IC50
1.30±n/a nM
Citation
 Verner, EBrameld, KA Quinolone derivatives as fibroblast growth factor receptor inhibitors US Patent  US11078199 Publication Date 8/3/2021 
Target
Name:
Fibroblast growth factor receptor 1
Synonyms:
BFGFR Basic fibroblast growth factor receptor 1 (FGFR1) CEK FGFR-1 FGFR-1, (FL) FGFR1_HUMAN FLT2 Fibroblast growth factor receptor 1 (FGFR-1) Fms-like tyrosine kinase 2 N-sam bFGF-R | c-fgr
Type:
Receptor
Mol. Mass.:
91861.70
Organism:
Homo sapiens (Human)
Description:
P11362
Residue:
822
  
Inhibitor
Name:
BDBM287158
Synonyms:
8-(2-((1-acryloylazetidin-3-yl)oxy)ethyl)-6-(2,6-dichloro-3,5-dimethoxyphenyl)-2-(((1r,4r)-4-hydroxycyclohexyl)amino)pyrido[2,3-d]pyrimidin-7(8H)-one US11078199, Cpd 109 US9815834, Compound 109
Type:
Small organic molecule
Emp. Form.:
C29H33Cl2N5O6
Mol. Mass.:
618.508
SMILES:
COc1cc(OC)c(Cl)c(c1Cl)-c1cc2cnc(N[C@H]3CC[C@H](O)CC3)nc2n(CCOC2CN(C2)C(=O)C=C)c1=O
: