Target
Fibroblast growth factor receptor 1
Ligand
BDBM287531
Substrate
Meas. Tech.
Enzymatic Activity Assay
IC50
1.20±n/a nM
Citation
 Verner, EBrameld, KA Quinolone derivatives as fibroblast growth factor receptor inhibitors US Patent  US11078199 Publication Date 8/3/2021 
Target
Name:
Fibroblast growth factor receptor 1
Synonyms:
BFGFR Basic fibroblast growth factor receptor 1 (FGFR1) CEK FGFR-1 FGFR-1, (FL) FGFR1_HUMAN FLT2 Fibroblast growth factor receptor 1 (FGFR-1) Fms-like tyrosine kinase 2 N-sam bFGF-R | c-fgr
Type:
Receptor
Mol. Mass.:
91861.70
Organism:
Homo sapiens (Human)
Description:
P11362
Residue:
822
  
Inhibitor
Name:
BDBM287531
Synonyms:
8-(2-((1-acryloylazetidin-3-yl)oxy)ethyl)-6-(2,6-dichloro-3,5-dimethoxyphenyl)-2-(((1-ethylpiperidin-4-yl)methyl)amino)pyrido[2,3-d]pyrimidin-7(8H)-one US11078199, Cpd 95 US9815834, Compound 95
Type:
Small organic molecule
Emp. Form.:
C31H38Cl2N6O5
Mol. Mass.:
645.577
SMILES:
CCN1CCC(CNc2ncc3cc(-c4c(Cl)c(OC)cc(OC)c4Cl)c(=O)n(CCOC4CN(C4)C(=O)C=C)c3n2)CC1
: