Target
Fibroblast growth factor receptor 1
Ligand
BDBM287553
Substrate
Meas. Tech.
Enzymatic Activity Assay
IC50
1.10±n/a nM
Citation
 Verner, EBrameld, KA Quinolone derivatives as fibroblast growth factor receptor inhibitors US Patent  US11078199 Publication Date 8/3/2021 
Target
Name:
Fibroblast growth factor receptor 1
Synonyms:
BFGFR Basic fibroblast growth factor receptor 1 (FGFR1) CEK FGFR-1 FGFR-1, (FL) FGFR1_HUMAN FLT2 Fibroblast growth factor receptor 1 (FGFR-1) Fms-like tyrosine kinase 2 N-sam bFGF-R | c-fgr
Type:
Receptor
Mol. Mass.:
91861.70
Organism:
Homo sapiens (Human)
Description:
P11362
Residue:
822
  
Inhibitor
Name:
BDBM287553
Synonyms:
(R)-8-(2-((1-acryloylazetidin-3-yl)(methyl)amino)propyl)-6-(2,6-dichloro-3,5-dimethoxyphenyl)-2-(methylamino)pyrido[2,3-d]pyrimidin-7(8H)-one US11078199, Cpd 125 | US9567334, Example 125
Type:
Small organic molecule
Emp. Form.:
C26H30Cl2N6O4
Mol. Mass.:
561.46
SMILES:
CNc1ncc2cc(-c3c(Cl)c(OC)cc(OC)c3Cl)c(=O)n(C[C@@H](C)N(C)C3CN(C3)C(=O)C=C)c2n1
: