Target
Fibroblast growth factor receptor 1
Ligand
BDBM287554
Substrate
Meas. Tech.
Enzymatic Activity Assay
IC50
1.40±n/a nM
Citation
 Verner, EBrameld, KA Quinolone derivatives as fibroblast growth factor receptor inhibitors US Patent  US11078199 Publication Date 8/3/2021 
Target
Name:
Fibroblast growth factor receptor 1
Synonyms:
BFGFR Basic fibroblast growth factor receptor 1 (FGFR1) CEK FGFR-1 FGFR-1, (FL) FGFR1_HUMAN FLT2 Fibroblast growth factor receptor 1 (FGFR-1) Fms-like tyrosine kinase 2 N-sam bFGF-R | c-fgr
Type:
Receptor
Mol. Mass.:
91861.70
Organism:
Homo sapiens (Human)
Description:
P11362
Residue:
822
  
Inhibitor
Name:
BDBM287554
Synonyms:
1-(3-(4-acryloylpiperazin-1-yl)propyl)-7-amino-3-(2,6-dichloro-3,5-dimethoxy-phenyl)-1,6-naphthyridin-2(1H)-one US9567334, Example 148
Type:
Small organic molecule
Emp. Form.:
C26H29Cl2N5O4
Mol. Mass.:
546.446
SMILES:
COc1cc(OC)c(Cl)c(c1Cl)-c1cc2cnc(N)cc2n(CCCN2CCN(CC2)C(=O)C=C)c1=O
: