Target
Fibroblast growth factor receptor 1
Ligand
BDBM387926
Substrate
Meas. Tech.
Enzymatic Activity Assay
IC50
0.700±n/a nM
Citation
 Verner, EBrameld, KA Quinolone derivatives as fibroblast growth factor receptor inhibitors US Patent  US11078199 Publication Date 8/3/2021 
Target
Name:
Fibroblast growth factor receptor 1
Synonyms:
BFGFR Basic fibroblast growth factor receptor 1 (FGFR1) CEK FGFR-1 FGFR-1, (FL) FGFR1_HUMAN FLT2 Fibroblast growth factor receptor 1 (FGFR-1) Fms-like tyrosine kinase 2 N-sam bFGF-R | c-fgr
Type:
Receptor
Mol. Mass.:
91861.70
Organism:
Homo sapiens (Human)
Description:
P11362
Residue:
822
  
Inhibitor
Name:
BDBM387926
Synonyms:
1-(2-((1-acryloylazetidin-3-yl)(2-methoxyethyl)amino)ethyl)-3-(2,6-dichloro-3,5-dimethoxyphenyl)-7-(methylamino)-1,6-naphthyridin-2(1H)-one US11078199, Cpd 153
Type:
Small organic molecule
Emp. Form.:
C28H33Cl2N5O5
Mol. Mass.:
590.498
SMILES:
CNc1cc2n(CCN(CCOC)C3CN(C3)C(=O)C=C)c(=O)c(cc2cn1)-c1c(Cl)c(OC)cc(OC)c1Cl
: