Target
Histone-lysine N-methyltransferase EZH2 [Y641F]
Ligand
BDBM50287277
Substrate
Meas. Tech.
Assay for Determining the Activity of the Example Compounds of the Present Invention on EZH2 Enzyme (A677G Mutant or Y641F Mutant)
IC50
2.30±n/a nM
Citation
 Lu, BShen, XHe, MLiu, DZhang, M Benzofuran derivative, preparation method thereof and use thereof in medicine US Patent  US11059811 Publication Date 7/13/2021 
Target
Name:
Histone-lysine N-methyltransferase EZH2 [Y641F]
Synonyms:
EZH2 EZH2_HUMAN KMT6
Type:
Mol. Mass.:
85351.84
Organism:
Homo sapiens (Human)
Description:
Q15910[Y641F]
Residue:
746
  
Inhibitor
Name:
BDBM50287277
Synonyms:
CHEMBL4170753 US11059811, Example 18
Type:
Small organic molecule
Emp. Form.:
C25H31N3O5
Mol. Mass.:
453.5307
SMILES:
CCN(C1CCOCC1)c1cc2occc2c(C(=O)NCc2c(OC)cc(C)[nH]c2=O)c1C
: