Target
Kallikrein-1
Ligand
BDBM408797
Substrate
Meas. Tech.
Inhibitory Activity In Vitro Assay
IC50
>10000±n/a nM
Citation
 Davie, RLEdwards, HJEvans, DMHodgson, ST N-((HET)arylmethyl)-heteroaryl-carboxamides compounds as kallikrein inhibitors US Patent  US11084809 Publication Date 8/10/2021 
Target
Name:
Kallikrein-1
Synonyms:
KLK1 Kallikrein 1 Kidney/pancreas/salivary gland kallikrein | Tissue kallikrein
Type:
Enzyme
Mol. Mass.:
28874.69
Organism:
Homo sapiens (Human)
Description:
P06870
Residue:
262
  
Inhibitor
Name:
BDBM408797
Synonyms:
N-[(2,6-difluoro-3-methoxyphenyl)methyl]-3-(methoxymethyl)-1-({4-[(4-methyl-2- oxopyridin-1-yl)methyl]phenyl}methyl)pyrazole-4-carboxamide US11001578, Example 106 US11198691, Example 106
Type:
Small organic molecule
Emp. Form.:
C28H28F2N4O4
Mol. Mass.:
522.5431
SMILES:
COCc1nn(Cc2ccc(Cn3ccc(C)cc3=O)cc2)cc1C(=O)NCc1c(F)ccc(OC)c1F
: