Target
Nuclear receptor ROR-beta
Ligand
BDBM302860
Substrate
Meas. Tech.
Biological Assay
Ki
>12500±0 nM
Citation
 Morphy, JR Compounds useful for inhibiting ROR-gamma-t US Patent  US9598431 Publication Date 3/21/2017 
Target
Name:
Nuclear receptor ROR-beta
Synonyms:
NR1F2 Nuclear receptor subfamily 1 group F member 2 RORB_HUMAN Retinoid-related orphan receptor-beta
Type:
PROTEIN
Mol. Mass.:
53227.30
Organism:
Homo sapiens (Human)
Description:
ChEMBL_107979
Residue:
470
  
Inhibitor
Name:
BDBM302860
Synonyms:
(2S)-1-(3-Thienyl)propan-2-ol | US9598431, 3
Type:
Small organic molecule
Emp. Form.:
C28H32F3N5O4S2
Mol. Mass.:
623.71
SMILES:
CCS(=O)(=O)c1ccc(CNC(=O)c2cc3C[C@H](C)OC4(CCN(CC4)[C@H](C)c4cnc(nc4)C(F)(F)F)c3s2)nc1
: