Target
Replicase polyprotein 1ab
Ligand
BDBM512701
Substrate
Meas. Tech.
In vitro assay (SARS-CoV-2 M proenzymatic assay)
IC50
1700±n/a nM
Citation
 Zavoronkovs, AIVANENKOV, YAZAGRIBELNYY, B Sars-cov-2 inhibitors having covalent modifications for treating coronavirus infections WIPO 0:0 (2021) Target
Name:
Replicase polyprotein 1ab
Synonyms:
ORF1ab polyprotein pp1ab | rep
Type:
Protein
Mol. Mass.:
794070.71
Organism:
2019-nCoV
Description:
P0DTD1
Residue:
7096
  
Inhibitor
Name:
BDBM512701
Synonyms:
WO2021219089, INSCoV-614 (2B)
Type:
Small organic molecule
Emp. Form.:
C23H21ClF3N5O2S
Mol. Mass.:
523.958
SMILES:
F[C@@H](Cl)C(=O)N([C@@H](C(=O)NC1CCC(F)(F)CC1)c1cncnc1)c1ccc(cc1)-c1cncs1
: