Target
Replicase polyprotein 1ab
Ligand
BDBM512793
Substrate
Meas. Tech.
In vitro assay (SARS-CoV-2 M proenzymatic assay)
IC50
6980±n/a nM
Citation
 Zavoronkovs, AIVANENKOV, YAZAGRIBELNYY, B Sars-cov-2 inhibitors having covalent modifications for treating coronavirus infections WIPO 0:0 (2021) Target
Name:
Replicase polyprotein 1ab
Synonyms:
ORF1ab polyprotein pp1ab | rep
Type:
Protein
Mol. Mass.:
794070.71
Organism:
2019-nCoV
Description:
P0DTD1
Residue:
7096
  
Inhibitor
Name:
BDBM512793
Synonyms:
WO2021219089, INSCoV-600Q
Type:
Small organic molecule
Emp. Form.:
C23H25F3N4O3
Mol. Mass.:
462.4648
SMILES:
Fc1cccc(CCN(C(C(=O)NC2CCC(F)(F)CC2)c2cncnc2)C(=O)C2CO2)c1
: