Target
Replicase polyprotein 1ab
Ligand
BDBM512911
Substrate
Meas. Tech.
In vitro assay (SARS-CoV-2 M proenzymatic assay)
IC50
19390±n/a nM
Citation
 Zavoronkovs, AIVANENKOV, YAZAGRIBELNYY, B Sars-cov-2 inhibitors having covalent modifications for treating coronavirus infections WIPO 0:0 (2021) Target
Name:
Replicase polyprotein 1ab
Synonyms:
ORF1ab polyprotein pp1ab | rep
Type:
Protein
Mol. Mass.:
794070.71
Organism:
2019-nCoV
Description:
P0DTD1
Residue:
7096
  
Inhibitor
Name:
BDBM512911
Synonyms:
WO2021219089, INSCoV-704
Type:
Small organic molecule
Emp. Form.:
C25H22ClN5O4
Mol. Mass.:
491.926
SMILES:
CC1(C)OCc2cc(cnc12)N(C(C(=O)Nc1cncc2ccccc12)c1ccno1)C(=O)CCl
: