Target
Cyclin-dependent kinase/G1/S-specific cyclin- 2
Ligand
BDBM50464633
Substrate
Meas. Tech.
Kinase Inhibitory Activity Assay
IC50
327±n/a nM
Citation
 Yin, LLiu, WLi, HZhu, D Protein kinase inhibitors, preparation method and medical use thereof US Patent  US11091476 Publication Date 8/17/2021 
Target
Name:
Cyclin-dependent kinase/G1/S-specific cyclin- 2
Synonyms:
CDK1/D2
Type:
Protein
Mol. Mass.:
Description:
Components:
This complex has 2 components.
Component 1
Name:
Cyclin-dependent kinase 2
Synonyms:
CDK2 CDK2_HUMAN Cell division protein kinase 2 Protein cereblon/Cyclin-dependent kinase 2 | p33 protein kinase
Type:
Enzyme Subunit
Mol. Mass.:
33938.17
Organism:
Homo sapiens (Human)
Description:
P24941
Residue:
298
  
Component 2
Name:
G1/S-specific cyclin-D2
Synonyms:
CCND2 CDK6/cyclin D2 | G1/S-specific cyclin-D2
Type:
PROTEIN
Mol. Mass.:
33058.33
Organism:
Homo sapiens (Human)
Description:
ChEMBL_108400
Residue:
289
  
Inhibitor
Name:
BDBM50464633
Synonyms:
CHEMBL4285830 | US11091476, Example 13
Type:
Small organic molecule
Emp. Form.:
C27H28F2N6
Mol. Mass.:
474.5482
SMILES:
CC1=Nc2c(cc(cc2F)-c2nc(Nc3ccc(cn3)C3CCNCC3)ncc2F)C11CCCC1
: